BDBM50139795 (S)-6-Acetimidoylamino-2-(R)-amino-5-fluoro-hexanoic acid::CHEMBL170864
SMILES CC(=N)NC[C@@H](F)CC[C@@H](N)C(O)=O
InChI Key InChIKey=JCNDIEMMUWNKKT-NKWVEPMBSA-N
Data  3 IC50
  Tab Delimited (TSV)   2D SDfile   Computed 3D by Vconf -m prep SDfile
Find this compound or compounds like it in BindingDB:
Activity Spreadsheet -- Enzyme Inhibition Constant Data from BindingDB
Found 1 hit for monomerid = 50139795
TargetNitric oxide synthase, brain(Homo sapiens (Human))
Pfizer
Curated by ChEMBL
LigandPNGBDBM50139795((S)-6-Acetimidoylamino-2-(R)-amino-5-fluoro-hexano...)
Affinity DataIC50:  3.11E+5nM. Assay description: Inhibition concentration against Neuronal nitric oxide synthase (nNOS) at 10 uM concentration
In DepthDetails ArticlePubMed